Target
P2Y purinoceptor 14
Ligand
BDBM50456168
Substrate
Meas. Tech.
ChEMBL_1848896 (CHEMBL4349437)
Ki
35±n/a nM
Citation
 Lu, RZhang, ZJiang, C Recent progress on the discovery of P2Y Eur J Med Chem 175:34-39 (2019)  
Target
Name:
P2Y purinoceptor 14
Synonyms:
G-protein coupled receptor 105 P2Y14 P2ry14 | UDP-glucose receptor
Type:
PROTEIN
Mol. Mass.:
38883.93
Organism:
Mus musculus
Description:
ChEMBL_745158
Residue:
338
  
Inhibitor
Name:
BDBM50456168
Synonyms:
CHEMBL1800685
Type:
Small organic molecule
Emp. Form.:
C29H24F3NO2
Mol. Mass.:
475.5016
SMILES:
OC(=O)c1cc(-c2ccc(cc2)C2CCNCC2)c2ccc(cc2c1)-c1ccc(cc1)C(F)(F)F
: