Target
Sterol O-acyltransferase 1
Ligand
BDBM50196069
Substrate
Meas. Tech.
ChEMBL_1849337 (CHEMBL4349878)
IC50
32000±n/a nM
Citation
 Ohshiro, TKobayashi, KSuzuki, AYamazaki, HUchida, RNamikoshi, MTomoda, H Inhibition of neutral lipid synthesis by avarols from a marine sponge. Bioorg Med Chem Lett 29:2283-2285 (2019)  
Target
Name:
Sterol O-acyltransferase 1
Synonyms:
ACAT ACAT1 Cholesterol acyltransferase 1 SOAT1_CRIGR
Type:
PROTEIN
Mol. Mass.:
64129.93
Organism:
Cricetulus griseus
Description:
ChEMBL_102587
Residue:
546
  
Inhibitor
Name:
BDBM50196069
Synonyms:
CHEMBL3965313
Type:
Small organic molecule
Emp. Form.:
C21H30O2
Mol. Mass.:
314.4617
SMILES:
[H][C@@]12CCCC(=C)[C@@]1(C)CC[C@H](C)[C@@]2(C)Cc1cc(O)ccc1O
: