Target
Mineralocorticoid receptor
Ligand
BDBM50067678
Substrate
Meas. Tech.
ChEMBL_44199 (CHEMBL654292)
IC50
1197±n/a nM
Citation
 Tegley, CMZhi, LMarschke, KBGottardis, MMYang, QJones, TK 5-Benzylidene 1,2-dihydrochromeno[3,4-f]quinolines, a novel class of nonsteroidal human progesterone receptor agonists. J Med Chem 41:4354-9 (1998)  
Target
Name:
Mineralocorticoid receptor
Synonyms:
MCR MLR NR3C2 | Nuclear receptor subfamily 3 group C member 2
Type:
Enzyme
Mol. Mass.:
107076.42
Organism:
Homo sapiens (Human)
Description:
P08235
Residue:
984
  
Inhibitor
Name:
BDBM50067678
Synonyms:
(6alpha)-17-(Acetyloxy)-6-methylpreg-4-ene-3,20-dione 17-Acetoxy-6alpha-methylprogesterone 6-alpha-Methyl-17-alpha-acetoxyprogesterone 6alpha-Methyl-17-acetoxy progesterone 6alpha-Methyl-4-pregnene-3,20-dion-17alpha-ol acetate Medroxyacetate progesterone Methylacetoxyprogesterone US9271961, MPA | medroxyprogesterone acetate
Type:
Small organic molecule
Emp. Form.:
C24H34O4
Mol. Mass.:
386.5244
SMILES:
C[C@H]1C[C@H]2[C@@H]3CC[C@](OC(C)=O)(C(C)=O)[C@@]3(C)CC[C@@H]2[C@@]2(C)CCC(=O)C=C12
: