Target
D(4) dopamine receptor
Ligand
BDBM50048233
Substrate
Meas. Tech.
ChEMBL_60814 (CHEMBL674966)
Ki
0.7±n/a nM
Citation
 Perrone, RBerardi, FColabufo, NALeopoldo, MTortorella, V N-[2-[4-(4-Chlorophenyl)piperazin-1-yl]ethyl]-3-methoxybenzamide: a potent and selective dopamine D4 ligand. J Med Chem 41:4903-9 (1998)  
Target
Name:
D(4) dopamine receptor
Synonyms:
D(2C) dopamine receptor DOPAMINE D4.2 DRD4 Dopamine D4 receptor
Type:
Enzyme
Mol. Mass.:
48373.19
Organism:
Homo sapiens (Human)
Description:
P21917
Residue:
419
  
Inhibitor
Name:
BDBM50048233
Synonyms:
1-(2-Methoxy-phenyl)-4-(1-phenyl-1H-pyrrol-3-ylmethyl)-piperazine | CHEMBL28321
Type:
Small organic molecule
Emp. Form.:
C22H25N3O
Mol. Mass.:
347.4534
SMILES:
COc1ccccc1N1CCN(Cc2ccn(c2)-c2ccccc2)CC1
: