Target
E3 ubiquitin-protein ligase Mdm2
Ligand
BDBM50513204
Substrate
Meas. Tech.
ChEMBL_1852374 (CHEMBL4352998)
Ki
0.440000±n/a nM
Citation
 Liu, YWang, XWang, GYang, YYuan, YOuyang, L The past, present and future of potential small-molecule drugs targeting p53-MDM2/MDMX for cancer therapy. Eur J Med Chem 176:92-104 (2019)  
Target
Name:
E3 ubiquitin-protein ligase Mdm2
Synonyms:
Double minute 2 protein E3 ubiquitin-protein ligase Mdm2 (p53-binding protein Mdm2) Human Double Minute 2 (HDM2) MDM2-MDMX p53-Binding Protein MDM2 | p53-binding protein
Type:
Oncoprotein
Mol. Mass.:
55196.54
Organism:
Homo sapiens (Human)
Description:
Q00987
Residue:
491
  
Inhibitor
Name:
BDBM50513204
Synonyms:
CHEMBL4537250
Type:
Small organic molecule
Emp. Form.:
C28H32Cl2FN3O3
Mol. Mass.:
548.476
SMILES:
CC(C)(C)C[C@H]1NC([C@H](c2cccc(Cl)c2F)[C@@]11C(=O)Nc2cc(Cl)ccc12)C(=O)N[C@H]1C[C@@](C)(O)C1
: