Target
E3 ubiquitin-protein ligase Mdm2
Ligand
BDBM50513202
Substrate
Meas. Tech.
ChEMBL_1852382 (CHEMBL4353006)
Ki
0.045000±n/a nM
Citation
 Liu, YWang, XWang, GYang, YYuan, YOuyang, L The past, present and future of potential small-molecule drugs targeting p53-MDM2/MDMX for cancer therapy. Eur J Med Chem 176:92-104 (2019)  
Target
Name:
E3 ubiquitin-protein ligase Mdm2
Synonyms:
Double minute 2 protein E3 ubiquitin-protein ligase Mdm2 (p53-binding protein Mdm2) Human Double Minute 2 (HDM2) MDM2-MDMX p53-Binding Protein MDM2 | p53-binding protein
Type:
Oncoprotein
Mol. Mass.:
55196.54
Organism:
Homo sapiens (Human)
Description:
Q00987
Residue:
491
  
Inhibitor
Name:
BDBM50513202
Synonyms:
CHEMBL4463050
Type:
Small organic molecule
Emp. Form.:
C26H31Cl2NO5S
Mol. Mass.:
540.499
SMILES:
CC(C)[C@H](N1[C@@H]([C@@H](C[C@H](CC(O)=O)C1=O)c1cccc(Cl)c1)c1ccc(Cl)cc1)S(=O)(=O)C(C)C
: