Target
Carbonic anhydrase 9
Ligand
BDBM50513288
Substrate
Meas. Tech.
ChEMBL_1852932 (CHEMBL4353556)
Ki
105±n/a nM
Citation
 Angeli, ADi Cesare Mannelli, LGhelardini, CPeat, TSBartolucci, GMenicatti, MCarta, FSupuran, CT Benzensulfonamides bearing spyrohydantoin moieties act as potent inhibitors of human carbonic anhydrases II and VII and show neuropathic pain attenuating effects. Eur J Med Chem 177:188-197 (2019)  
Target
Name:
Carbonic anhydrase 9
Synonyms:
CA-IX CAH9_HUMAN Carbonic anhydrase 9 (CA IX) Carbonic anhydrase 9 precursor Carbonic anhydrase IX (CAIX) Carbonic anhydrases; II & IX MN RCC-associated antigen G250
Type:
Enzyme
Mol. Mass.:
49669.03
Organism:
Homo sapiens (Human)
Description:
Catalytic domain of human cloned isozyme was used in the assay
Residue:
459
  
Inhibitor
Name:
BDBM50513288
Synonyms:
CHEMBL4443862
Type:
Small organic molecule
Emp. Form.:
C17H22N4O5S
Mol. Mass.:
394.445
SMILES:
NS(=O)(=O)c1ccc(CNC(=O)CN2C(=O)NC3(CCCCC3)C2=O)cc1
: