Target
Nuclear receptor subfamily 1 group I member 3
Ligand
BDBM50513497
Substrate
Meas. Tech.
ChEMBL_1853466 (CHEMBL4354090)
EC50
1300±n/a nM
Citation
 Liang, DLi, LLynch, CMackowiak, BHedrich, WDAi, YYin, YHeyward, SXia, MWang, HXue, F Human constitutive androstane receptor agonist DL5016: A novel sensitizer for cyclophosphamide-based chemotherapies. Eur J Med Chem 179:84-99 (2019)  
Target
Name:
Nuclear receptor subfamily 1 group I member 3
Synonyms:
CAR NR1I3_HUMAN
Type:
PROTEIN
Mol. Mass.:
39953.17
Organism:
Homo sapiens (Human)
Description:
ChEMBL_1434936
Residue:
352
  
Inhibitor
Name:
BDBM50513497
Synonyms:
CHEMBL4436336
Type:
Small organic molecule
Emp. Form.:
C20H16Cl3N3O
Mol. Mass.:
420.72
SMILES:
Clc1ccc(cc1)-c1nc2occn2c1CNCCc1ccc(Cl)c(Cl)c1
: