Target
Amine oxidase [flavin-containing] A
Ligand
BDBM50046879
Substrate
Meas. Tech.
ChEMBL_1853663 (CHEMBL4354287)
IC50
>10000±n/a nM
Citation
 Tzvetkov, NTStammler, HGGeorgieva, MGRusso, DFaraone, IBalacheva, AAHristova, SAtanasov, AGMilella, LAntonov, LGastreich, M Carboxamides vs. methanimines: Crystal structures, binding interactions, photophysical studies, and biological evaluation of (indazole-5-yl)methanimines as monoamine oxidase B and acetylcholinesterase inhibitors. Eur J Med Chem 179:404-422 (2019)  
Target
Name:
Amine oxidase [flavin-containing] A
Synonyms:
AOFA_HUMAN MAO-A Monoamine oxidase Monoamine oxidase type A (MAO A) Monoamine oxidase type A (MAOA)
Type:
Protein
Mol. Mass.:
59689.53
Organism:
Homo sapiens (Human)
Description:
P21397
Residue:
527
  
Inhibitor
Name:
BDBM50046879
Synonyms:
CHEMBL3317469
Type:
Small organic molecule
Emp. Form.:
C14H9ClFN3O
Mol. Mass.:
289.692
SMILES:
Fc1ccc(NC(=O)c2ccc3[nH]ncc3c2)cc1Cl
: