Target
Amine oxidase [flavin-containing] A
Ligand
BDBM50513574
Substrate
Meas. Tech.
ChEMBL_1853663 (CHEMBL4354287)
IC50
>10000±n/a nM
Citation
 Tzvetkov, NTStammler, HGGeorgieva, MGRusso, DFaraone, IBalacheva, AAHristova, SAtanasov, AGMilella, LAntonov, LGastreich, M Carboxamides vs. methanimines: Crystal structures, binding interactions, photophysical studies, and biological evaluation of (indazole-5-yl)methanimines as monoamine oxidase B and acetylcholinesterase inhibitors. Eur J Med Chem 179:404-422 (2019)  
Target
Name:
Amine oxidase [flavin-containing] A
Synonyms:
AOFA_HUMAN MAO-A Monoamine oxidase Monoamine oxidase type A (MAO A) Monoamine oxidase type A (MAOA)
Type:
Protein
Mol. Mass.:
59689.53
Organism:
Homo sapiens (Human)
Description:
P21397
Residue:
527
  
Inhibitor
Name:
BDBM50513574
Synonyms:
CHEMBL4539722
Type:
Small organic molecule
Emp. Form.:
C13H8Cl2N4
Mol. Mass.:
291.135
SMILES:
Clc1cc(cnc1Cl)\N=C\c1ccc2[nH]ncc2c1
: