Target
Amine oxidase [flavin-containing] A
Ligand
BDBM50232429
Substrate
Meas. Tech.
ChEMBL_1853663 (CHEMBL4354287)
Ki
0.480000±n/a nM
Citation
 Tzvetkov, NTStammler, HGGeorgieva, MGRusso, DFaraone, IBalacheva, AAHristova, SAtanasov, AGMilella, LAntonov, LGastreich, M Carboxamides vs. methanimines: Crystal structures, binding interactions, photophysical studies, and biological evaluation of (indazole-5-yl)methanimines as monoamine oxidase B and acetylcholinesterase inhibitors. Eur J Med Chem 179:404-422 (2019)  
Target
Name:
Amine oxidase [flavin-containing] A
Synonyms:
AOFA_HUMAN MAO-A Monoamine oxidase Monoamine oxidase type A (MAO A) Monoamine oxidase type A (MAOA)
Type:
Protein
Mol. Mass.:
59689.53
Organism:
Homo sapiens (Human)
Description:
P21397
Residue:
527
  
Inhibitor
Name:
BDBM50232429
Synonyms:
CHEMBL4104691
Type:
Small organic molecule
Emp. Form.:
C17H15Cl2N3O2
Mol. Mass.:
364.226
SMILES:
COCCn1ncc2cc(ccc12)C(=O)Nc1ccc(Cl)c(Cl)c1
: