Target
Amine oxidase [flavin-containing] B
Ligand
BDBM50513575
Substrate
Meas. Tech.
ChEMBL_1853664 (CHEMBL4354288)
IC50
1.9±n/a nM
Citation
 Tzvetkov, NTStammler, HGGeorgieva, MGRusso, DFaraone, IBalacheva, AAHristova, SAtanasov, AGMilella, LAntonov, LGastreich, M Carboxamides vs. methanimines: Crystal structures, binding interactions, photophysical studies, and biological evaluation of (indazole-5-yl)methanimines as monoamine oxidase B and acetylcholinesterase inhibitors. Eur J Med Chem 179:404-422 (2019)  
Target
Name:
Amine oxidase [flavin-containing] B
Synonyms:
AOFB_HUMAN MAOB Monoamine oxidase type B (MAO B) Monoamine oxidase type B (MAOB)
Type:
Protein
Mol. Mass.:
58768.76
Organism:
Homo sapiens (Human)
Description:
P27338
Residue:
520
  
Inhibitor
Name:
BDBM50513575
Synonyms:
CHEMBL4567537
Type:
Small organic molecule
Emp. Form.:
C14H9ClFN3
Mol. Mass.:
273.693
SMILES:
Fc1cc(ccc1Cl)\N=C\c1ccc2[nH]ncc2c1
: