Target
Amine oxidase [flavin-containing] B
Ligand
BDBM19187
Substrate
Meas. Tech.
ChEMBL_1853664 (CHEMBL4354288)
IC50
5.1±n/a nM
Citation
 Tzvetkov, NTStammler, HGGeorgieva, MGRusso, DFaraone, IBalacheva, AAHristova, SAtanasov, AGMilella, LAntonov, LGastreich, M Carboxamides vs. methanimines: Crystal structures, binding interactions, photophysical studies, and biological evaluation of (indazole-5-yl)methanimines as monoamine oxidase B and acetylcholinesterase inhibitors. Eur J Med Chem 179:404-422 (2019)  
Target
Name:
Amine oxidase [flavin-containing] B
Synonyms:
AOFB_HUMAN MAOB Monoamine oxidase type B (MAO B) Monoamine oxidase type B (MAOB)
Type:
Protein
Mol. Mass.:
58768.76
Organism:
Homo sapiens (Human)
Description:
P27338
Residue:
520
  
Inhibitor
Name:
BDBM19187
Synonyms:
(2S)-2-[({4-[(3-fluorophenyl)methoxy]phenyl}methyl)amino]propanamide SAG US9051240, (S)-(+)-2-[4-(3-Fluorobenzyloxy)-benzylamino]-propanamide
Type:
Small organic molecule
Emp. Form.:
C17H19FN2O2
Mol. Mass.:
302.3434
SMILES:
[H][C@@](C)(NCc1ccc(OCc2cccc(F)c2)cc1)C(N)=O
: