Target
Amine oxidase [flavin-containing] B
Ligand
BDBM50046866
Substrate
Meas. Tech.
ChEMBL_1853675 (CHEMBL4354299)
IC50
1.3±n/a nM
Citation
 Tzvetkov, NTStammler, HGGeorgieva, MGRusso, DFaraone, IBalacheva, AAHristova, SAtanasov, AGMilella, LAntonov, LGastreich, M Carboxamides vs. methanimines: Crystal structures, binding interactions, photophysical studies, and biological evaluation of (indazole-5-yl)methanimines as monoamine oxidase B and acetylcholinesterase inhibitors. Eur J Med Chem 179:404-422 (2019)  
Target
Name:
Amine oxidase [flavin-containing] B
Synonyms:
AOFB_RAT Amine oxidase [flavin-containing] B Monoamine Oxidase Type B (MAO-B) Monoamine oxidase B (MAO-B) Monoamine oxidase type B (MAOB) | Monoamine oxidase-B (MAO-B)
Type:
Enzyme
Mol. Mass.:
58469.65
Organism:
Rattus norvegicus (rat)
Description:
P19643
Residue:
520
  
Inhibitor
Name:
BDBM50046866
Synonyms:
CHEMBL3319256
Type:
Small organic molecule
Emp. Form.:
C15H11Cl2N3O
Mol. Mass.:
320.173
SMILES:
Cn1ncc2cc(ccc12)C(=O)Nc1ccc(Cl)c(Cl)c1
: