Target
Amine oxidase [flavin-containing] B
Ligand
BDBM50232429
Substrate
Meas. Tech.
ChEMBL_1853664 (CHEMBL4354288)
IC50
1.1±n/a nM
Citation
 Tzvetkov, NTStammler, HGGeorgieva, MGRusso, DFaraone, IBalacheva, AAHristova, SAtanasov, AGMilella, LAntonov, LGastreich, M Carboxamides vs. methanimines: Crystal structures, binding interactions, photophysical studies, and biological evaluation of (indazole-5-yl)methanimines as monoamine oxidase B and acetylcholinesterase inhibitors. Eur J Med Chem 179:404-422 (2019)  
Target
Name:
Amine oxidase [flavin-containing] B
Synonyms:
AOFB_HUMAN MAOB Monoamine oxidase type B (MAO B) Monoamine oxidase type B (MAOB)
Type:
Protein
Mol. Mass.:
58768.76
Organism:
Homo sapiens (Human)
Description:
P27338
Residue:
520
  
Inhibitor
Name:
BDBM50232429
Synonyms:
CHEMBL4104691
Type:
Small organic molecule
Emp. Form.:
C17H15Cl2N3O2
Mol. Mass.:
364.226
SMILES:
COCCn1ncc2cc(ccc12)C(=O)Nc1ccc(Cl)c(Cl)c1
: