Target
Amine oxidase [flavin-containing] B
Ligand
BDBM50046871
Substrate
Meas. Tech.
ChEMBL_1853664 (CHEMBL4354288)
IC50
5.4±n/a nM
Citation
 Tzvetkov, NTStammler, HGGeorgieva, MGRusso, DFaraone, IBalacheva, AAHristova, SAtanasov, AGMilella, LAntonov, LGastreich, M Carboxamides vs. methanimines: Crystal structures, binding interactions, photophysical studies, and biological evaluation of (indazole-5-yl)methanimines as monoamine oxidase B and acetylcholinesterase inhibitors. Eur J Med Chem 179:404-422 (2019)  
Target
Name:
Amine oxidase [flavin-containing] B
Synonyms:
AOFB_HUMAN MAOB Monoamine oxidase type B (MAO B) Monoamine oxidase type B (MAOB)
Type:
Protein
Mol. Mass.:
58768.76
Organism:
Homo sapiens (Human)
Description:
P27338
Residue:
520
  
Inhibitor
Name:
BDBM50046871
Synonyms:
CHEMBL3319254
Type:
Small organic molecule
Emp. Form.:
C13H8Cl2N4O
Mol. Mass.:
307.135
SMILES:
Clc1cc(NC(=O)c2ccc3[nH]ncc3c2)cnc1Cl
: