Target
Chymase
Ligand
BDBM50068914
Substrate
Meas. Tech.
ChEBML_49443
Ki
23±n/a nM
Citation
 Eda, MAshimori, AAkahoshi, FYoshimura, TInoue, YFukaya, CNakajima, MFukuyama, HImada, TTakai, SShiota, NMiyazaki, MNakamura, N Peptidyl human heart chymase inhibitors. 2. Discovery of highly selective difluoromethylene ketone derivatives with Glu at P3 site. Bioorg Med Chem Lett 8:919-24 (1999)  
Target
Name:
Chymase
Synonyms:
Alpha-chymase CMA1_HUMAN CYM Mast cell protease I
Type:
Enzyme
Mol. Mass.:
27340.12
Organism:
Homo sapiens (Human)
Description:
Residue:
247
  
Inhibitor
Name:
BDBM50068914
Synonyms:
5-{(S)-2-[1-Benzyl-3-(3-butylsulfamoyl-phenylcarbamoyl)-3,3-difluoro-2-oxo-propylcarbamoyl]-pyrrolidin-1-yl}-4-tert-butoxycarbonylamino-5-oxo-pentanoic acid | CHEMBL433799
Type:
Small organic molecule
Emp. Form.:
C36H47F2N5O10S
Mol. Mass.:
779.848
SMILES:
CCCCNS(=O)(=O)c1cccc(NC(=O)C(F)(F)C(=O)C(Cc2ccccc2)NC(=O)[C@@H]2CCCN2C(=O)C(CCC(O)=O)NC(=O)OC(C)(C)C)c1
: