Target
Androgen receptor
Ligand
BDBM50069073
Substrate
Meas. Tech.
ChEMBL_36136 (CHEMBL648325)
Ki
79±n/a nM
Citation
 Edwards, JPWest, SJPooley, CLMarschke, KBFarmer, LJJones, TK New nonsteroidal androgen receptor modulators based on 4-(trifluoromethyl)-2(1H)-pyrrolidino[3,2-g] quinolinone. Bioorg Med Chem Lett 8:745-50 (1999)  
Target
Name:
Androgen receptor
Synonyms:
ANDR_HUMAN Androgen Receptor Androgen receptor/Baculoviral IAP repeat-containing protein 2 Dihydrotestosterone receptor Nuclear receptor subfamily 3 group C member 4
Type:
Receptor
Mol. Mass.:
99185.27
Organism:
Homo sapiens (Human)
Description:
CHO cells were stably transfected with human AR gene.
Residue:
920
  
Inhibitor
Name:
BDBM50069073
Synonyms:
(5bR,9aS)-9,9-Dimethyl-4-trifluoromethyl-1,5b,6,7,8,9,9a,10-octahydro-pyrido[2,3-b]carbazol-2-one | CHEMBL162368
Type:
Small organic molecule
Emp. Form.:
C18H19F3N2O
Mol. Mass.:
336.3515
SMILES:
CC1(C)CCC[C@H]2[C@@H]1Nc1cc3[nH]c(=O)cc(c3cc21)C(F)(F)F
: