Target
Androgen receptor
Ligand
BDBM50069082
Substrate
Meas. Tech.
ChEMBL_36136 (CHEMBL648325)
Ki
41±n/a nM
Citation
 Edwards, JPWest, SJPooley, CLMarschke, KBFarmer, LJJones, TK New nonsteroidal androgen receptor modulators based on 4-(trifluoromethyl)-2(1H)-pyrrolidino[3,2-g] quinolinone. Bioorg Med Chem Lett 8:745-50 (1999)  
Target
Name:
Androgen receptor
Synonyms:
ANDR_HUMAN Androgen Receptor Androgen receptor/Baculoviral IAP repeat-containing protein 2 Dihydrotestosterone receptor Nuclear receptor subfamily 3 group C member 4
Type:
Receptor
Mol. Mass.:
99185.27
Organism:
Homo sapiens (Human)
Description:
CHO cells were stably transfected with human AR gene.
Residue:
920
  
Inhibitor
Name:
BDBM50069082
Synonyms:
5-Trifluoromethyl-1,2,3,8-tetrahydro-pyrrolo[3,2-g]quinolin-7-one | CHEMBL166323
Type:
Small organic molecule
Emp. Form.:
C12H9F3N2O
Mol. Mass.:
254.2079
SMILES:
FC(F)(F)c1cc(=O)[nH]c2cc3NCCc3cc12
: