Target
Androgen receptor
Ligand
BDBM50069061
Substrate
Meas. Tech.
ChEMBL_36100 (CHEMBL884023)
IC50
54±n/a nM
Citation
 Edwards, JPWest, SJPooley, CLMarschke, KBFarmer, LJJones, TK New nonsteroidal androgen receptor modulators based on 4-(trifluoromethyl)-2(1H)-pyrrolidino[3,2-g] quinolinone. Bioorg Med Chem Lett 8:745-50 (1999)  
Target
Name:
Androgen receptor
Synonyms:
ANDR_HUMAN Androgen Receptor Androgen receptor/Baculoviral IAP repeat-containing protein 2 Dihydrotestosterone receptor Nuclear receptor subfamily 3 group C member 4
Type:
Receptor
Mol. Mass.:
99185.27
Organism:
Homo sapiens (Human)
Description:
CHO cells were stably transfected with human AR gene.
Residue:
920
  
Inhibitor
Name:
BDBM50069061
Synonyms:
(5bR,7S,9aR)-1,7,10-Trimethyl-4-trifluoromethyl-1,5b,6,7,8,9,9a,10-octahydro-pyrido[2,3-b]carbazol-2-one | CHEMBL161980
Type:
Small organic molecule
Emp. Form.:
C19H21F3N2O
Mol. Mass.:
350.378
SMILES:
C[C@H]1CC[C@@H]2[C@H](C1)c1cc3c(cc(=O)n(C)c3cc1N2C)C(F)(F)F
: