Target
Androgen receptor
Ligand
BDBM50069066
Substrate
Meas. Tech.
ChEMBL_36133 (CHEMBL648322)
Ki
9±n/a nM
Citation
 Edwards, JPWest, SJPooley, CLMarschke, KBFarmer, LJJones, TK New nonsteroidal androgen receptor modulators based on 4-(trifluoromethyl)-2(1H)-pyrrolidino[3,2-g] quinolinone. Bioorg Med Chem Lett 8:745-50 (1999)  
Target
Name:
Androgen receptor
Synonyms:
ANDR_HUMAN Androgen Receptor Androgen receptor/Baculoviral IAP repeat-containing protein 2 Dihydrotestosterone receptor Nuclear receptor subfamily 3 group C member 4
Type:
Receptor
Mol. Mass.:
99185.27
Organism:
Homo sapiens (Human)
Description:
CHO cells were stably transfected with human AR gene.
Residue:
920
  
Inhibitor
Name:
BDBM50069066
Synonyms:
(R)-2,8-Dimethyl-5-trifluoromethyl-1,2,3,8-tetrahydro-pyrrolo[3,2-g]quinolin-7-one | CHEMBL163366
Type:
Small organic molecule
Emp. Form.:
C14H13F3N2O
Mol. Mass.:
282.261
SMILES:
C[C@@H]1Cc2cc3c(cc(=O)n(C)c3cc2N1)C(F)(F)F
: