Target
Receptor-type tyrosine-protein kinase FLT3
Ligand
BDBM50513773
Substrate
Meas. Tech.
ChEMBL_1854148 (CHEMBL4354772)
IC50
9.3±n/a nM
Citation
 Xu, QDai, BLi, ZXu, LYang, DGong, PHou, YLiu, Y Design, synthesis, and biological evaluation of 4-((6,7-dimethoxyquinoline-4-yl)oxy)aniline derivatives as FLT3 inhibitors for the treatment of acute myeloid leukemia. Bioorg Med Chem Lett 29:0 (2019)  
Target
Name:
Receptor-type tyrosine-protein kinase FLT3
Synonyms:
CD135 FL cytokine receptor FLK2 FLT3 Fetal liver kinase-2 Fms-like tyrosine kinase 3 (Flt-3) STK-1 Stem cell tyrosine kinase 1
Type:
Enzyme
Mol. Mass.:
112888.62
Organism:
Homo sapiens (Human)
Description:
P36888
Residue:
993
  
Inhibitor
Name:
BDBM50513773
Synonyms:
CHEMBL3290929
Type:
Small organic molecule
Emp. Form.:
C35H34FN5O6
Mol. Mass.:
639.6728
SMILES:
COc1cc2c(Oc3ccc(NC(=O)c4nn(-c5ccccc5)c(=O)cc4C)cc3F)ccnc2cc1OCCCN1CCOCC1
: