Target
Receptor-type tyrosine-protein kinase FLT3
Ligand
BDBM50513774
Substrate
Meas. Tech.
ChEMBL_1854152 (CHEMBL4354776)
IC50
>1000±n/a nM
Citation
 Xu, QDai, BLi, ZXu, LYang, DGong, PHou, YLiu, Y Design, synthesis, and biological evaluation of 4-((6,7-dimethoxyquinoline-4-yl)oxy)aniline derivatives as FLT3 inhibitors for the treatment of acute myeloid leukemia. Bioorg Med Chem Lett 29:0 (2019)  
Target
Name:
Receptor-type tyrosine-protein kinase FLT3
Synonyms:
CD135 FL cytokine receptor FLK2 FLT3 Fetal liver kinase-2 Fms-like tyrosine kinase 3 (Flt-3) STK-1 Stem cell tyrosine kinase 1
Type:
Enzyme
Mol. Mass.:
112888.62
Organism:
Homo sapiens (Human)
Description:
P36888
Residue:
993
  
Inhibitor
Name:
BDBM50513774
Synonyms:
CHEMBL4446493
Type:
Small organic molecule
Emp. Form.:
C27H22ClN7O4
Mol. Mass.:
543.961
SMILES:
COc1cc2nccc(Oc3ccc(NC(=O)N\N=C\c4cn(nn4)-c4cccc(Cl)c4)cc3)c2cc1OC
: