Target
Acetylcholinesterase
Ligand
BDBM50069247
Substrate
Meas. Tech.
ChEMBL_27796 (CHEMBL637623)
Ki
3400±n/a nM
Citation
 Perola, ECellai, LBrufani, M Synthesis and activity studies of N-[omega-N'-(adamant-1'-yl)aminoalkyl]- 2-(4'-dimethylaminophenyl)acetamides: in the search of selective inhibitors for the different molecular forms of acetylcholinesterase. Bioorg Med Chem Lett 8:575-80 (1999)  
Target
Name:
Acetylcholinesterase
Synonyms:
3.1.1.7 Acetylcholinesterase (AChE) ache
Type:
Mol. Mass.:
65900.74
Organism:
Tetronarce californica (Pacific electric ray) (Torpedo californica)
Description:
P04058
Residue:
586
  
Inhibitor
Name:
BDBM50069247
Synonyms:
CHEMBL157429 | N-[9-(Adamantan-1-ylamino)-nonyl]-2-(4-dimethylamino-phenyl)-acetamide
Type:
Small organic molecule
Emp. Form.:
C29H47N3O
Mol. Mass.:
453.703
SMILES:
CN(C)c1ccc(CC(=O)NCCCCCCCCCNC23CC4CC(CC(C4)C2)C3)cc1
: