Target
Nonstructural protein 3
Ligand
BDBM50236531
Substrate
Meas. Tech.
ChEMBL_1855280 (CHEMBL4356009)
IC50
99000±n/a nM
Citation
 Bernatchez, JATran, LTLi, JLuan, YSiqueira-Neto, JLLi, R Drugs for the Treatment of Zika Virus Infection. J Med Chem 63:470-489 (2020)  
Target
Name:
Nonstructural protein 3
Synonyms:
Genome polyprotein | NS3
Type:
PROTEIN
Mol. Mass.:
7653.58
Organism:
Zika virus
Description:
ChEMBL_119671
Residue:
66
  
Inhibitor
Name:
BDBM50236531
Synonyms:
(-)-gallocatechin gallate (2S,3R)-5,7-dihydroxy-2-(3,4,5-trihydroxyphenyl)-3,4-dihydro-2H-chromen-3-yl 3,4,5-trihydroxybenzoate CHEMBL264938 gallocatechin gallate
Type:
Small organic molecule
Emp. Form.:
C22H18O11
Mol. Mass.:
458.3717
SMILES:
Oc1cc(O)c2C[C@@H](OC(=O)c3cc(O)c(O)c(O)c3)[C@@H](Oc2c1)c1cc(O)c(O)c(O)c1
: