Target
Genome polyprotein
Ligand
BDBM50513995
Substrate
Meas. Tech.
ChEMBL_1855256 (CHEMBL4355985)
EC50
14300±n/a nM
Citation
 Bernatchez, JATran, LTLi, JLuan, YSiqueira-Neto, JLLi, R Drugs for the Treatment of Zika Virus Infection. J Med Chem 63:470-489 (2020)  
Target
Name:
Genome polyprotein
Synonyms:
NS5
Type:
PROTEIN
Mol. Mass.:
39098.80
Organism:
Zika virus
Description:
ChEMBL_119669
Residue:
340
  
Inhibitor
Name:
BDBM50513995
Synonyms:
BCX-4430 Galidesivir
Type:
Small organic molecule
Emp. Form.:
C11H15N5O3
Mol. Mass.:
265.2685
SMILES:
Nc1ncnc2c(c[nH]c12)[C@@H]1N[C@H](CO)[C@@H](O)[C@H]1O
: