Target
Transitional endoplasmic reticulum ATPase
Ligand
BDBM50514004
Substrate
Meas. Tech.
ChEMBL_1855350 (CHEMBL4356079)
IC50
8.0±n/a nM
Citation
 Huryn, DMKornfilt, DJPWipf, P p97: An Emerging Target for Cancer, Neurodegenerative Diseases, and Viral Infections. J Med Chem 63:1892-1907 (2020)  
Target
Name:
Transitional endoplasmic reticulum ATPase
Synonyms:
TERA_HUMAN VCP Valosin-containing protein
Type:
Enzyme
Mol. Mass.:
89300.63
Organism:
Homo sapiens (Human)
Description:
P55072
Residue:
806
  
Inhibitor
Name:
BDBM50514004
Synonyms:
CHEMBL4476693
Type:
Small organic molecule
Emp. Form.:
C30H33F2N5O3S
Mol. Mass.:
590.732
SMILES:
[2H]C1([2H])C([2H])([2H])C([2H])([2H])C([2H])(Sc2ncc(COc3cc(F)c(cc3F)C#CCOC(=O)NC3CCN(C)CC3)n2-c2cccnc2)C1([2H])[2H]
: