Target
Transitional endoplasmic reticulum ATPase
Ligand
BDBM31774
Substrate
Meas. Tech.
ChEMBL_1855346 (CHEMBL4356075)
IC50
12000±n/a nM
Citation
 Huryn, DMKornfilt, DJPWipf, P p97: An Emerging Target for Cancer, Neurodegenerative Diseases, and Viral Infections. J Med Chem 63:1892-1907 (2020)  
Target
Name:
Transitional endoplasmic reticulum ATPase
Synonyms:
TERA_HUMAN VCP Valosin-containing protein
Type:
Enzyme
Mol. Mass.:
89300.63
Organism:
Homo sapiens (Human)
Description:
P55072
Residue:
806
  
Inhibitor
Name:
BDBM31774
Synonyms:
CHEMBL104 Clotrimazole Mycelex cid_2812
Type:
Small organic molecule
Emp. Form.:
C22H17ClN2
Mol. Mass.:
344.837
SMILES:
Clc1ccccc1C(c1ccccc1)(c1ccccc1)n1ccnc1
: