Target
Transitional endoplasmic reticulum ATPase
Ligand
BDBM50468108
Substrate
Meas. Tech.
ChEMBL_1855335 (CHEMBL4356064)
IC50
20±n/a nM
Citation
 Huryn, DMKornfilt, DJPWipf, P p97: An Emerging Target for Cancer, Neurodegenerative Diseases, and Viral Infections. J Med Chem 63:1892-1907 (2020)  
Target
Name:
Transitional endoplasmic reticulum ATPase
Synonyms:
TERA_HUMAN VCP Valosin-containing protein
Type:
Enzyme
Mol. Mass.:
89300.63
Organism:
Homo sapiens (Human)
Description:
P55072
Residue:
806
  
Inhibitor
Name:
BDBM50468108
Synonyms:
CHEMBL4280125 | US11247985, Table 3.59
Type:
Small organic molecule
Emp. Form.:
C28H38FN5
Mol. Mass.:
463.6332
SMILES:
CC(C)N1CCN(CCNC2CCN(CC2)c2cccc(c2)-c2cc3cc(F)ccc3[nH]2)CC1
: