Target
Histamine H4 receptor
Ligand
BDBM50514105
Substrate
Meas. Tech.
ChEMBL_1855652 (CHEMBL4356381)
EC50
3.2±n/a nM
Citation
 Wágner, GMocking, TAMArimont, MProvensi, GRani, BSilva-Marques, BLatacz, GDa Costa Pereira, DKaratzidou, CVischer, HFWijtmans, MKie?-Kononowicz, Kde Esch, IJPLeurs, R 4-(3-Aminoazetidin-1-yl)pyrimidin-2-amines as High-Affinity Non-imidazole Histamine H J Med Chem 62:10848-10866 (2019)  
Target
Name:
Histamine H4 receptor
Synonyms:
AXOR35 GPCR105 HH4R HRH4 Histamine H4 receptor Histamine receptor (H3 and H4) SP9144
Type:
G Protein-Coupled Receptor (GPCR)
Mol. Mass.:
44517.02
Organism:
Homo sapiens (Human)
Description:
Binding assays were using CHO cells stably expressing hH4R receptors.
Residue:
390
  
Inhibitor
Name:
BDBM50514105
Synonyms:
CHEMBL4441731
Type:
Small organic molecule
Emp. Form.:
C14H23N5O5
Mol. Mass.:
341.3629
SMILES:
O.OC(=O)\C=C\C(O)=O.CCCNC1CN(C1)c1ccnc(N)n1
: