Target
Sphingosine kinase 2
Ligand
BDBM50514473
Substrate
Meas. Tech.
ChEMBL_1856910 (CHEMBL4357639)
Ki
89±n/a nM
Citation
 Sibley, CDMorris, EAKharel, YBrown, AMHuang, TBevan, DRLynch, KRSantos, WL Discovery of a Small Side Cavity in Sphingosine Kinase 2 that Enhances Inhibitor Potency and Selectivity. J Med Chem 63:1178-1198 (2020)  
Target
Name:
Sphingosine kinase 2
Synonyms:
SK 2 SPHK2 SPK 2 Sphingosine kinase types 2 (SphK2)
Type:
Protein
Mol. Mass.:
69221.44
Organism:
Homo sapiens (Human)
Description:
Q9NRA0
Residue:
654
  
Inhibitor
Name:
BDBM50514473
Synonyms:
CHEMBL4453931
Type:
Small organic molecule
Emp. Form.:
C22H20ClF6N5O2
Mol. Mass.:
535.87
SMILES:
Cl.NC(=N)N1CCC[C@H]1c1nc(no1)-c1ccc(OCc2ccc(cc2)C(F)(F)F)c(c1)C(F)(F)F
: