Target
Sphingosine kinase 2
Ligand
BDBM50514477
Substrate
Meas. Tech.
ChEMBL_1856910 (CHEMBL4357639)
Ki
192±n/a nM
Citation
 Sibley, CDMorris, EAKharel, YBrown, AMHuang, TBevan, DRLynch, KRSantos, WL Discovery of a Small Side Cavity in Sphingosine Kinase 2 that Enhances Inhibitor Potency and Selectivity. J Med Chem 63:1178-1198 (2020)  
Target
Name:
Sphingosine kinase 2
Synonyms:
SK 2 SPHK2 SPK 2 Sphingosine kinase types 2 (SphK2)
Type:
Protein
Mol. Mass.:
69221.44
Organism:
Homo sapiens (Human)
Description:
Q9NRA0
Residue:
654
  
Inhibitor
Name:
BDBM50514477
Synonyms:
CHEMBL4593983
Type:
Small organic molecule
Emp. Form.:
C24H27ClF3N5O2
Mol. Mass.:
509.952
SMILES:
Cl.CC(C)c1cc(ccc1OCc1ccc(cc1)C(F)(F)F)-c1noc(n1)[C@@H]1CCCN1C(N)=N
: