Target
Bromodomain-containing protein 1
Ligand
BDBM50514857
Substrate
Meas. Tech.
ChEMBL_1858871 (CHEMBL4359600)
Kd
126±n/a nM
Citation
 Lucas, SCCAtkinson, SJBamborough, PBarnett, HChung, CWGordon, LMitchell, DJPhillipou, APrinjha, RKSheppard, RJTomkinson, NCOWatson, RJDemont, EH Optimization of Potent ATAD2 and CECR2 Bromodomain Inhibitors with an Atypical Binding Mode. J Med Chem 63:5212-5241 (2020)  
Target
Name:
Bromodomain-containing protein 1
Synonyms:
BR140-like protein BRD1_HUMAN BRL Bromodomain and PHD finger-containing protein 2 | Bromodomain-containing protein 1
Type:
PROTEIN
Mol. Mass.:
119557.65
Organism:
Homo sapiens (Human)
Description:
ChEMBL_105349
Residue:
1058
  
Inhibitor
Name:
BDBM50514857
Synonyms:
CHEMBL4449894
Type:
Small organic molecule
Emp. Form.:
C20H25BrN4O5S
Mol. Mass.:
513.405
SMILES:
C[C@H]1CCN(C1)S(=O)(=O)c1cc(NC(=O)CN2C(=O)N[C@@](C)(C3CC3)C2=O)ccc1Br
: