Target
ATPase family AAA domain-containing protein 2B
Ligand
BDBM50514857
Substrate
Meas. Tech.
ChEMBL_1858869 (CHEMBL4359598)
Kd
20±n/a nM
Citation
 Lucas, SCCAtkinson, SJBamborough, PBarnett, HChung, CWGordon, LMitchell, DJPhillipou, APrinjha, RKSheppard, RJTomkinson, NCOWatson, RJDemont, EH Optimization of Potent ATAD2 and CECR2 Bromodomain Inhibitors with an Atypical Binding Mode. J Med Chem 63:5212-5241 (2020)  
Target
Name:
ATPase family AAA domain-containing protein 2B
Synonyms:
ATAD2B ATPase family AAA domain-containing protein 2B | KIAA1240
Type:
PROTEIN
Mol. Mass.:
164918.65
Organism:
Homo sapiens (Human)
Description:
ChEMBL_105350
Residue:
1458
  
Inhibitor
Name:
BDBM50514857
Synonyms:
CHEMBL4449894
Type:
Small organic molecule
Emp. Form.:
C20H25BrN4O5S
Mol. Mass.:
513.405
SMILES:
C[C@H]1CCN(C1)S(=O)(=O)c1cc(NC(=O)CN2C(=O)N[C@@](C)(C3CC3)C2=O)ccc1Br
: