Target
Beta-3 adrenergic receptor
Ligand
BDBM50070140
Substrate
Meas. Tech.
ChEBML_38912
EC50
27±n/a nM
Citation
 Weber, AEMathvink, RJPerkins, LHutchins, JECandelore, MRTota, LStrader, CDWyvratt, MJFisher, MH Potent, selective benzenesulfonamide agonists of the human beta 3 adrenergic receptor. Bioorg Med Chem Lett 8:1101-6 (1999)  
Target
Name:
Beta-3 adrenergic receptor
Synonyms:
ADRB3 ADRB3_HUMAN Beta-2 adrenergic receptor and beta-3 adrenergic receptor Beta-3 adrenoreceptor | adrenergic Beta3
Type:
G Protein-Coupled Receptor (GPCR)
Mol. Mass.:
43534.88
Organism:
Homo sapiens (Human)
Description:
Residue:
408
  
Inhibitor
Name:
BDBM50070140
Synonyms:
CHEMBL13102 | N-(4-{2-[(S)-2-Hydroxy-3-(4-hydroxy-phenoxy)-propylamino]-ethyl}-phenyl)-acetamide
Type:
Small organic molecule
Emp. Form.:
C19H24N2O4
Mol. Mass.:
344.4049
SMILES:
CC(=O)Nc1ccc(CCNC[C@H](O)COc2ccc(O)cc2)cc1
: