Target
Cannabinoid receptor 1/2
Ligand
BDBM50353747
Substrate
Meas. Tech.
ChEMBL_1859865 (CHEMBL4360721)
Kd
3.4±n/a nM
Citation
 Dvorácskó, SKeresztes, AMollica, AStefanucci, AMacedonio, GPieretti, SZádor, FWalter, FRDeli, MAKékesi, GBánki, LTuboly, GHorváth, GTömböly, C Preparation of bivalent agonists for targeting the mu opioid and cannabinoid receptors. Eur J Med Chem 178:571-588 (2019)  
Target
Name:
Cannabinoid receptor 1/2
Synonyms:
Cannabinoid receptor
Type:
Mol. Mass.:
Description:
ASSAY_ID of ChEMBL is 1859866
Components:
This complex has 2 components.
Component 1
Name:
Cannabinoid receptor 2
Synonyms:
CANNABINOID CB2 CB2 Cannabinoid CB2 receptor Cnr2 | rCB2
Type:
Enzyme
Mol. Mass.:
39366.68
Organism:
Rattus norvegicus (Rat)
Description:
Q9QZN9
Residue:
360
  
Component 2
Name:
Cannabinoid receptor 1
Synonyms:
Brain-type cannabinoid receptor CB-R CNR1_RAT Cannabinoid receptor Cnr1 | Skr6
Type:
G Protein-Coupled Receptor (GPCR)
Mol. Mass.:
52856.55
Organism:
Rattus norvegicus (rat)
Description:
P20272
Residue:
473
  
Inhibitor
Name:
BDBM50353747
Synonyms:
CHEMBL561013 | JWH-018
Type:
Small organic molecule
Emp. Form.:
C24H23NO
Mol. Mass.:
341.4455
SMILES:
CCCCCn1cc(C(=O)c2cccc3ccccc23)c2ccccc12
: