Target
Cholinesterase
Ligand
BDBM50515461
Substrate
Meas. Tech.
ChEMBL_1861128 (CHEMBL4361984)
Ki
3.2±n/a nM
Citation
 Roldán-Peña, JMRomero-Real, VHicke, JMaya, IFranconetti, ALagunes, IPadrón, JMPetralla, SPoeta, ENaldi, MBartolini, MMonti, BBolognesi, MLLópez, ÓFernández-Bolaños, JG Tacrine-O-protected phenolics heterodimers as multitarget-directed ligands against Alzheimer's disease: Selective subnanomolar BuChE inhibitors. Eur J Med Chem 181:0 (2019)  
Target
Name:
Cholinesterase
Synonyms:
BCHE CHLE_HORSE | Cholinesterase
Type:
Enzyme
Mol. Mass.:
65643.35
Organism:
Equus caballus (Horse)
Description:
P81908
Residue:
574
  
Inhibitor
Name:
BDBM50515461
Synonyms:
CHEMBL4535585
Type:
Small organic molecule
Emp. Form.:
C20H20N2O2
Mol. Mass.:
320.385
SMILES:
Oc1ccc(CNc2c3CCCCc3nc3ccccc23)cc1O
: