Target
Tyrosine-protein kinase Lyn
Ligand
BDBM50089575
Substrate
Meas. Tech.
ChEMBL_1861462 (CHEMBL4362318)
Ki
190±n/a nM
Citation
 Fallacara, ALPassannanti, RMori, MIovenitti, GMusumeci, FGreco, CCrespan, EKissova, MMaga, GTarantelli, CSpriano, FGaudio, EBertoni, FBotta, MSchenone, S Identification of a new family of pyrazolo[3,4-d]pyrimidine derivatives as multitarget Fyn-Blk-Lyn inhibitors active on B- and T-lymphoma cell lines. Eur J Med Chem 181:0 (2019)  
Target
Name:
Tyrosine-protein kinase Lyn
Synonyms:
JTK8 LYN_HUMAN Tyrosine-protein kinase Lyn (LYN) p53Lyn | p56Lyn
Type:
Protein
Mol. Mass.:
58575.92
Organism:
Homo sapiens (Human)
Description:
P07948
Residue:
512
  
Inhibitor
Name:
BDBM50089575
Synonyms:
CHEMBL3578214
Type:
Small organic molecule
Emp. Form.:
C19H15Cl2N5
Mol. Mass.:
384.262
SMILES:
Nc1ncnc2n(CC(Cl)c3ccccc3)nc(-c3ccc(Cl)cc3)c12
: