Target
Dipeptidyl peptidase 4
Ligand
BDBM50070542
Substrate
Meas. Tech.
ChEBML_53344
IC50
5700±n/a nM
Citation
 Yamada, MOkagaki, CHigashijima, TTanaka, SOhnuki, TSugita, T A potent dipeptide inhibitor of dipeptidyl peptidase IV. Bioorg Med Chem Lett 8:1537-40 (1999)  
Target
Name:
Dipeptidyl peptidase 4
Synonyms:
ADABP Adenosine deaminase complexing protein 2 CD_antigen=CD26 DPP4 DPPIV Dipeptidyl peptidase 4 (DPP IV) Dipeptidyl peptidase 4 (DPP4) Dipeptidyl peptidase 4 membrane form Dipeptidyl peptidase IV Dipeptidyl peptidase IV (DDP-IV) Dipeptidyl peptidase IV membrane form Dipeptidyl peptidase-IV (DPP-4) T-cell activation antigen CD26 | TP103
Type:
Enzyme
Mol. Mass.:
88271.01
Organism:
Homo sapiens (Human)
Description:
P27487
Residue:
766
  
Inhibitor
Name:
BDBM50070542
Synonyms:
(3S)-N-(L-Tryptophanyl)-1,2,3,4-tetrahydroisoquinoline-3-carboxylic acid CHEMBL37260
Type:
Small organic molecule
Emp. Form.:
C21H21N3O3
Mol. Mass.:
363.4097
SMILES:
N[C@@H](Cc1c[nH]c2ccccc12)C(=O)N1Cc2ccccc2C[C@H]1C(O)=O
: