Target
Dipeptidyl peptidase 4
Ligand
BDBM50070543
Substrate
Meas. Tech.
ChEBML_53344
IC50
7000±n/a nM
Citation
 Yamada, MOkagaki, CHigashijima, TTanaka, SOhnuki, TSugita, T A potent dipeptide inhibitor of dipeptidyl peptidase IV. Bioorg Med Chem Lett 8:1537-40 (1999)  
Target
Name:
Dipeptidyl peptidase 4
Synonyms:
ADABP Adenosine deaminase complexing protein 2 CD_antigen=CD26 DPP4 DPPIV Dipeptidyl peptidase 4 (DPP IV) Dipeptidyl peptidase 4 (DPP4) Dipeptidyl peptidase 4 membrane form Dipeptidyl peptidase IV Dipeptidyl peptidase IV (DDP-IV) Dipeptidyl peptidase IV membrane form Dipeptidyl peptidase-IV (DPP-4) T-cell activation antigen CD26 | TP103
Type:
Enzyme
Mol. Mass.:
88271.01
Organism:
Homo sapiens (Human)
Description:
P27487
Residue:
766
  
Inhibitor
Name:
BDBM50070543
Synonyms:
(S)-2-({(S)-2-[(S)-2-Amino-3-(1H-indol-3-yl)-propionyl]-1,2,3,4-tetrahydro-isoquinoline-3-carbonyl}-amino)-pentanedioic acid | CHEMBL290598
Type:
Small organic molecule
Emp. Form.:
C26H28N4O6
Mol. Mass.:
492.5237
SMILES:
N[C@@H](Cc1c[nH]c2ccccc12)C(=O)N1Cc2ccccc2C[C@H]1C(=O)N[C@@H](CCC(O)=O)C(O)=O
: