Target
Neuronal acetylcholine receptor subunit alpha-7
Ligand
BDBM50516168
Substrate
Meas. Tech.
ChEMBL_1863409 (CHEMBL4364384)
EC50
25±n/a nM
Citation
 Harvey, AJAvery, TDSchaeffer, LJoseph, CHuff, BCSingh, RMorice, CGiethlen, BGrishin, AAColes, CJKolesik, PWagner, SAndriambeloson, EHuyard, BPoiraud, EPaul, DO'Connor, SM Discovery of BNC375, a Potent, Selective, and Orally Available Type I Positive Allosteric Modulator of ?7 nAChRs. ACS Med Chem Lett 10:754-760 (2019)  
Target
Name:
Neuronal acetylcholine receptor subunit alpha-7
Synonyms:
ACHA7_RAT Cholinergic, Nicotinic Alpha7 Chrna7 Neuronal acetylcholine receptor (alpha7 nAChR) Neuronal acetylcholine receptor subunit alpha-7 Neuronal acetylcholine receptor subunit alpha-7 (nAChR)
Type:
Enzyme
Mol. Mass.:
56502.44
Organism:
Rattus norvegicus (Rat)
Description:
Q05941
Residue:
502
  
Inhibitor
Name:
BDBM50516168
Synonyms:
CHEMBL4541269
Type:
Small organic molecule
Emp. Form.:
C19H23ClN2O3S
Mol. Mass.:
394.916
SMILES:
COc1ccc(Cl)cc1NCC1C(c2ccc(cc2)S(N)(=O)=O)C1(C)C
: