Target
Substance-K receptor
Ligand
BDBM50071113
Substrate
Meas. Tech.
ChEBML_142729
Ki
40±n/a nM
Citation
 Jacobs, RTShenvi, ABMauger, RCUlatowski, TGAharony, DBuckner, CK 4-Alkylpiperidines related to SR-48968: potent antagonists of the neurokinin-2 (NK2) receptor. Bioorg Med Chem Lett 8:1935-40 (1999)  
Target
Name:
Substance-K receptor
Synonyms:
NK-2 receptor NK2R NKNAR Neurokinin A receptor Neurokinin-2 (NK-2) SKR TACR2 Tachykinin receptor 2 (NK2) | hnk-3
Type:
Protein
Mol. Mass.:
44455.78
Organism:
Homo sapiens (Human)
Description:
P21452
Residue:
398
  
Inhibitor
Name:
BDBM50071113
Synonyms:
Acetic acid 2-{1-[4-(benzoyl-methyl-amino)-3-(3,4-dichloro-phenyl)-butyl]-piperidin-4-yl}-ethyl ester | CHEMBL57589
Type:
Small organic molecule
Emp. Form.:
C27H34Cl2N2O3
Mol. Mass.:
505.476
SMILES:
CN(CC(CCN1CCC(CCOC(C)=O)CC1)c1ccc(Cl)c(Cl)c1)C(=O)c1ccccc1
: