Target
Prostaglandin G/H synthase 2
Ligand
BDBM50516235
Substrate
Meas. Tech.
ChEMBL_1864068 (CHEMBL4365043)
EC50
>10000±n/a nM
Citation
 Amato, GManke, AWiethe, RVasukuttan, VSnyder, RYueh, YLDecker, ARunyon, SMaitra, R Functionalized 6-(Piperidin-1-yl)-8,9-Diphenyl Purines as Peripherally Restricted Inverse Agonists of the CB1 Receptor. J Med Chem 62:6330-6345 (2019)  
Target
Name:
Prostaglandin G/H synthase 2
Synonyms:
COX2 Cyclooxygenase 2 (COX-2) Cyclooxygenase-2 (COX-2 AA) Cyclooxygenase-2 (COX-2) PGH2_HUMAN PHS II Prostaglandin E synthase/G/H synthase 2 Prostaglandin-endoperoxide synthase 2
Type:
Enzyme
Mol. Mass.:
69003.89
Organism:
Homo sapiens (Human)
Description:
Recombinant Cox-2 provided by Cayman (Cayman Chemical Co.,Ann Arbor, MI).
Residue:
604
  
Inhibitor
Name:
BDBM50516235
Synonyms:
CHEMBL4563408
Type:
Small organic molecule
Emp. Form.:
C29H24Cl2F2N8O2
Mol. Mass.:
625.456
SMILES:
FC(F)Oc1ccc(NC(=O)NC2CCN(CC2)c2ncnc3n(c(nc23)-c2ccccc2Cl)-c2ccc(Cl)cc2)cn1
: