Target
Coagulation factor X
Ligand
BDBM50071418
Substrate
Meas. Tech.
ChEBML_48802
Ki
81±n/a nM
Citation
 Buckman, BOMohan, RKoovakkat, SLiang, ATrinh, LMorrissey, MM Design, synthesis, and biological activity of novel purine and bicyclic pyrimidine factor Xa inhibitors. Bioorg Med Chem Lett 8:2235-40 (1999)  
Target
Name:
Coagulation factor X
Synonyms:
Activated coagulation factor X (FXa) Coagulation factor X precursor F10 Factor X heavy chain Factor Xa Stuart-Prower factor
Type:
Enzyme
Mol. Mass.:
54726.60
Organism:
Homo sapiens (Human)
Description:
Residue:
488
  
Inhibitor
Name:
BDBM50071418
Synonyms:
3-[2-(5-Carbamimidoyl-2-hydroxy-phenoxy)-6-oxo-5,6,7,8-tetrahydro-pteridin-4-yloxy]-N,N-dimethyl-benzamide | CHEMBL307989
Type:
Small organic molecule
Emp. Form.:
C22H21N7O5
Mol. Mass.:
463.446
SMILES:
CN(C)C(=O)c1cccc(Oc2nc(Oc3cc(ccc3O)C(N)=N)nc3NCC(=O)Nc23)c1
: