Target
Prothrombin
Ligand
BDBM50066633
Substrate
Meas. Tech.
ChEBML_208351
Ki
>5000±n/a nM
Citation
 Buckman, BOMohan, RKoovakkat, SLiang, ATrinh, LMorrissey, MM Design, synthesis, and biological activity of novel purine and bicyclic pyrimidine factor Xa inhibitors. Bioorg Med Chem Lett 8:2235-40 (1999)  
Target
Name:
Prothrombin
Synonyms:
Activation peptide fragment 1 Coagulation factor II Prothrombin precursor Thrombin heavy chain | Thrombin light chain
Type:
Protein
Mol. Mass.:
70029.57
Organism:
Homo sapiens (Human)
Description:
P00734
Residue:
622
  
Inhibitor
Name:
BDBM50066633
Synonyms:
3-[6-(3-Carbamimidoyl-phenoxy)-3,5-difluoro-4-methyl-pyridin-2-yloxy]-N,N-dimethyl-benzamide | CHEMBL70730
Type:
Small organic molecule
Emp. Form.:
C22H20F2N4O3
Mol. Mass.:
426.416
SMILES:
CN(C)C(=O)c1cccc(Oc2nc(Oc3cccc(c3)C(N)=N)c(F)c(C)c2F)c1
: