Target
Coagulation factor X
Ligand
BDBM50071419
Substrate
Meas. Tech.
ChEBML_48802
Ki
10±n/a nM
Citation
 Buckman, BOMohan, RKoovakkat, SLiang, ATrinh, LMorrissey, MM Design, synthesis, and biological activity of novel purine and bicyclic pyrimidine factor Xa inhibitors. Bioorg Med Chem Lett 8:2235-40 (1999)  
Target
Name:
Coagulation factor X
Synonyms:
Activated coagulation factor X (FXa) Coagulation factor X precursor F10 Factor X heavy chain Factor Xa Stuart-Prower factor
Type:
Enzyme
Mol. Mass.:
54726.60
Organism:
Homo sapiens (Human)
Description:
Residue:
488
  
Inhibitor
Name:
BDBM50071419
Synonyms:
3-[9-Benzyl-2-(5-carbamimidoyl-2-hydroxy-phenoxy)-8-methyl-9H-purin-6-yloxy]-N,N-dimethyl-benzamide | CHEMBL72527
Type:
Small organic molecule
Emp. Form.:
C29H27N7O4
Mol. Mass.:
537.5692
SMILES:
CN(C)C(=O)c1cccc(Oc2nc(Oc3cc(ccc3O)C(N)=N)nc3n(Cc4ccccc4)c(C)nc23)c1
: