Target
Prothrombin
Ligand
BDBM17284
Substrate
Meas. Tech.
ChEBML_208351
Ki
2000±n/a nM
Citation
 Buckman, BOMohan, RKoovakkat, SLiang, ATrinh, LMorrissey, MM Design, synthesis, and biological activity of novel purine and bicyclic pyrimidine factor Xa inhibitors. Bioorg Med Chem Lett 8:2235-40 (1999)  
Target
Name:
Prothrombin
Synonyms:
Activation peptide fragment 1 Coagulation factor II Prothrombin precursor Thrombin heavy chain | Thrombin light chain
Type:
Protein
Mol. Mass.:
70029.57
Organism:
Homo sapiens (Human)
Description:
P00734
Residue:
622
  
Inhibitor
Name:
BDBM17284
Synonyms:
2-{[2-(5-carbamimidoyl-2-hydroxyphenoxy)-3,5-difluoro-6-[3-(1-methyl-4,5-dihydro-1H-imidazol-2-yl)phenoxy]pyridin-4-yl](methyl)amino}acetic acid CI-1031 | ZK-807834
Type:
Small organic molecule
Emp. Form.:
C25H24F2N6O5
Mol. Mass.:
526.4921
SMILES:
CN(CC(O)=O)c1c(F)c(Oc2cccc(c2)C2=NCCN2C)nc(Oc2cc(ccc2O)C(N)=N)c1F
: