Target
Serine protease 1
Ligand
BDBM50066623
Substrate
Meas. Tech.
ChEBML_212510
Ki
1100±n/a nM
Citation
 Buckman, BOMohan, RKoovakkat, SLiang, ATrinh, LMorrissey, MM Design, synthesis, and biological activity of novel purine and bicyclic pyrimidine factor Xa inhibitors. Bioorg Med Chem Lett 8:2235-40 (1999)  
Target
Name:
Serine protease 1
Synonyms:
Beta-Trypsin PRSS1 TRY1 TRYP1 Trypsin I
Type:
Enzyme
Mol. Mass.:
25790.52
Organism:
Bos taurus (bovine)
Description:
P00760
Residue:
246
  
Inhibitor
Name:
BDBM50066623
Synonyms:
CHEMBL72318 | {[2-(5-Carbamimidoyl-2-hydroxy-phenoxy)-6-(3-dimethylcarbamoyl-phenoxy)-3,5-difluoro-pyridin-4-yl]-methyl-amino}-acetic acid
Type:
Small organic molecule
Emp. Form.:
C24H23F2N5O6
Mol. Mass.:
515.4661
SMILES:
CN(C)C(=O)c1cccc(Oc2nc(Oc3cc(ccc3O)C(N)=N)c(F)c(N(C)CC(O)=O)c2F)c1
: