Target
Histamine H1 receptor
Ligand
BDBM50031228
Substrate
Meas. Tech.
ChEMBL_1866568 (CHEMBL4367543)
Ki
0.398107±n/a nM
Citation
 Bosma, RWang, ZKooistra, AJBushby, NKuhne, Svan den Bor, JWaring, MJde Graaf, Cde Esch, IJVischer, HFSheppard, RJWijtmans, MLeurs, R Route to Prolonged Residence Time at the Histamine H J Med Chem 62:6630-6644 (2019)  
Target
Name:
Histamine H1 receptor
Synonyms:
H1R HISTAMINE H1 HRH1_HUMAN
Type:
G Protein-Coupled Receptor (GPCR)
Mol. Mass.:
55808.72
Organism:
Homo sapiens (Human)
Description:
Cell pellets from SK-N-MC cells transfected with human H1 receptor were used in binding assay.
Residue:
487
  
Inhibitor
Name:
BDBM50031228
Synonyms:
CHEMBL420316
Type:
Small organic molecule
Emp. Form.:
C20H21ClN2
Mol. Mass.:
324.847
SMILES:
[#6]-[#7]-1-[#6]-[#6]\[#6](-[#6]-[#6]-1)=[#6]-1/c2ccc(Cl)cc2-[#6]-[#6]-c2cccnc-12
: