Target
Caspase-1
Ligand
BDBM50071542
Substrate
Meas. Tech.
ChEMBL_141001 (CHEMBL747009)
Ki
82±n/a nM
Citation
 Warmus, JSRyder, TRHodges, JCKennedy, RMBrady, KD Rapid optimization of an ICE inhibitor synthesis using multiple reaction conditions in a parallel array. Bioorg Med Chem Lett 8:2309-14 (1999)  
Target
Name:
Caspase-1
Synonyms:
CASP1 Caspase ICE IL1BCE Interleukin-1 beta-converting enzyme
Type:
Enzyme
Mol. Mass.:
45154.13
Organism:
Homo sapiens (Human)
Description:
P29466
Residue:
404
  
Inhibitor
Name:
BDBM50071542
Synonyms:
(S)-3-(2-Acetylamino-3-methyl-butyrylamino)-5-[2-(2,6-dichloro-phenyl)-acetoxy]-4-oxo-pentanoic acid | CHEMBL78154
Type:
Small organic molecule
Emp. Form.:
C20H24Cl2N2O7
Mol. Mass.:
475.32
SMILES:
CC(C)C(NC(C)=O)C(=O)N[C@@H](CC(O)=O)C(=O)COC(=O)Cc1c(Cl)cccc1Cl
: